{"text_format":"1","workbook":"xlsx","n_sheets":4,"sheets":["Summary","Input - Income","Input - Expenditure","General Assumptions"],"not_rendered":{"charts":0,"images":1,"macros":0,"external_links":23,"defined_names":399,"comments":0,"pivot_tables":0},"unopened":[],"bounds":{"document_bytes":16777216,"sheet_cells":100000,"rows_first":2000,"rows_last":500,"rows_between":2000,"halvings":0,"cell_chars":16384,"cell_head_chars":4096},"cells_cut":0,"cells_raw":0,"read":"whole","date_system":"1900"}

{"sheet":"Summary","index":0,"n_rows":85,"n_cols":12,"rows_kept":85,"cut":false,"hidden":false,"merged":[[0,0,0,7],[14,9,15,9],[81,2,81,7],[52,2,52,7]]}
["Summary business case"]
[]
["All figures in £'000",null,"2024-25","2025-26","2026-27","2027-28","2028-29","2029-30"]
[]
["Income"]
[]
["OFS Teaching Income",null,{"$f":"+'Input - Income'!C39+'Input - Income'!C72","v":0},{"$f":"+'Input - Income'!D39+'Input - Income'!D72","v":0},{"$f":"+'Input - Income'!E39+'Input - Income'!E72","v":0},{"$f":"+'Input - Income'!F39+'Input - Income'!F72","v":0},{"$f":"+'Input - Income'!G39+'Input - Income'!G72","v":0},{"$f":"+'Input - Income'!H39+'Input - Income'!H72","v":0}]
["Charity Support Funding",null,0,0,{"$f":"+SUM(B15:C15)/2*'General Assumptions'!B32","v":0},{"$f":"+SUM(C15:D15)/2*'General Assumptions'!C32","v":0},{"$f":"+SUM(D15:E15)/2*'General Assumptions'!C32","v":0},{"$f":"+SUM(E15:F15)/2*'General Assumptions'!D32","v":0},null,null,null,"Link"]
["RDP Funding",null,{"$f":"+'Input - Income'!C105","v":0},{"$f":"+'Input - Income'!D105","v":0},{"$f":"+'Input - Income'!E105","v":0},{"$f":"+'Input - Income'!F105","v":0},{"$f":"+'Input - Income'!G105","v":0},{"$f":"+'Input - Income'!H105","v":0},null,null,null,"Link"]
["UG Tuition fee income",null,{"$f":"+('Input - Income'!C11*'Input - Income'!C24)+'Input - Income'!C12*'Input - Income'!C36","v":0},{"$f":"+('Input - Income'!D11*'Input - Income'!D24)+'Input - Income'!D12*'Input - Income'!D36","v":0},{"$f":"+('Input - Income'!E11*'Input - Income'!E24)+'Input - Income'!E12*'Input - Income'!E36","v":0},{"$f":"+('Input - Income'!F11*'Input - Income'!F24)+'Input - Income'!F12*'Input - Income'!F36","v":0},{"$f":"+('Input - Income'!G11*'Input - Income'!G24)+'Input - Income'!G12*'Input - Income'!G36","v":0},{"$f":"+('Input - Income'!H11*'Input - Income'!H24)+'Input - Income'!H12*'Input - Income'!H36","v":0}]
["PGT Tuition fee income",null,{"$f":"+('Input - Income'!C58*'Input - Income'!C45)+('Input - Income'!C46*'Input - Income'!C70)","v":0},{"$f":"+('Input - Income'!D58*'Input - Income'!D45)+('Input - Income'!D46*'Input - Income'!D70)","v":0},{"$f":"+('Input - Income'!E58*'Input - Income'!E45)+('Input - Income'!E46*'Input - Income'!E70)","v":0},{"$f":"+('Input - Income'!F58*'Input - Income'!F45)+('Input - Income'!F46*'Input - Income'!F70)","v":0},{"$f":"+('Input - Income'!G58*'Input - Income'!G45)+('Input - Income'!G46*'Input - Income'!G70)","v":0},{"$f":"+('Input - Income'!H58*'Input - Income'!H45)+('Input - Income'!H46*'Input - Income'!H70)","v":0}]
["PGR Tuition fee income",null,{"$f":"+('Input - Income'!C78*'Input - Income'!C91)+('Input - Income'!C79*'Input - Income'!C103)","v":0},{"$f":"+('Input - Income'!D78*'Input - Income'!D91)+('Input - Income'!D79*'Input - Income'!D103)","v":0},{"$f":"+('Input - Income'!E78*'Input - Income'!E91)+('Input - Income'!E79*'Input - Income'!E103)","v":0},{"$f":"+('Input - Income'!F78*'Input - Income'!F91)+('Input - Income'!F79*'Input - Income'!F103)","v":0},{"$f":"+('Input - Income'!G78*'Input - Income'!G91)+('Input - Income'!G79*'Input - Income'!G103)","v":0},{"$f":"+('Input - Income'!H78*'Input - Income'!H91)+('Input - Income'!H79*'Input - Income'!H103)","v":0}]
["Waived fees",null,{"$f":"-'Input - Income'!C110","v":0},{"$f":"-'Input - Income'!D110","v":0},{"$f":"-'Input - Income'!E110","v":0},{"$f":"-'Input - Income'!F110","v":0},{"$f":"-'Input - Income'!G110","v":0},{"$f":"-'Input - Income'!H110","v":0}]
["International VAT education",null,{"$f":"'Input - Income'!C115","v":0},{"$f":"'Input - Income'!D115","v":0},{"$f":"'Input - Income'!E115","v":0},{"$f":"'Input - Income'!F115","v":0},{"$f":"'Input - Income'!G115","v":0},{"$f":"'Input - Income'!H115","v":0}]
["Research Income - Charity",null,{"$f":"+'Input - Income'!C120","v":0},{"$f":"+'Input - Income'!D120","v":0},{"$f":"+'Input - Income'!E120","v":0},{"$f":"+'Input - Income'!F120","v":0},{"$f":"+'Input - Income'!G120","v":0},{"$f":"+'Input - Income'!H120","v":0},null,null,null,"Link"]
["Research Income - Other",null,{"$f":"+'Input - Income'!C121","v":0},{"$f":"+'Input - Income'!D121","v":0},{"$f":"+'Input - Income'!E121","v":0},{"$f":"+'Input - Income'!F121","v":0},{"$f":"+'Input - Income'!G121","v":0},{"$f":"+'Input - Income'!H121","v":0},null,null,null,"Link"]
["Research Overheads",null,{"$f":"+'Input - Income'!C121*('Input - Income'!$C$119)","v":0},{"$f":"+'Input - Income'!D121*('Input - Income'!$C$119)","v":0},{"$f":"+'Input - Income'!E121*('Input - Income'!$C$119)","v":0},{"$f":"+'Input - Income'!F121*('Input - Income'!$C$119)","v":0},{"$f":"+'Input - Income'!G121*('Input - Income'!$C$119)","v":0},{"$f":"+'Input - Income'!H121*('Input - Income'!$C$119)","v":0},null,null,null,"Formula"]
["NHS Recharges",null,{"$f":"+'Input - Income'!C126","v":0},{"$f":"+'Input - Income'!D126","v":0},{"$f":"+'Input - Income'!E126","v":0},{"$f":"+'Input - Income'!F126","v":0},{"$f":"+'Input - Income'!G126","v":0},{"$f":"+'Input - Income'!H126","v":0}]
["CPD income",null,{"$f":"+'Input - Income'!C125","v":0},{"$f":"+'Input - Income'!D125","v":0},{"$f":"+'Input - Income'!E125","v":0},{"$f":"+'Input - Income'!F125","v":0},{"$f":"+'Input - Income'!G125","v":0},{"$f":"+'Input - Income'!H125","v":0},null,null,null,"Link"]
["Other income",null,{"$f":"+'Input - Income'!C127","v":0},{"$f":"+'Input - Income'!D127","v":0},{"$f":"+'Input - Income'!E127","v":0},{"$f":"+'Input - Income'!F127","v":0},{"$f":"+'Input - Income'!G127","v":0},{"$f":"+'Input - Income'!H127","v":0},null,null,null,"Link"]
[]
["Total Income",null,{"$f":"SUM(C6:C21)","v":0},{"$f":"SUM(D6:D21)","v":0},0,0,0,0]
[]
["Expenditure"]
[]
["Payroll"]
["QMUL Pay",null,{"$f":"+'Input - Expenditure'!C33","v":0},{"$f":"+'Input - Expenditure'!D33","v":0},{"$f":"+'Input - Expenditure'!E33","v":0},{"$f":"+'Input - Expenditure'!F33","v":0},{"$f":"+'Input - Expenditure'!G33","v":0},{"$f":"+'Input - Expenditure'!H33","v":0},null,null,null,"Link"]
["Research Pay",null,{"$f":"+('Input - Income'!C120+'Input - Income'!C121)*'General Assumptions'!B36","v":0},{"$f":"+('Input - Income'!D120+'Input - Income'!D121)*'General Assumptions'!C36","v":0},{"$f":"+('Input - Income'!E120+'Input - Income'!E121)*'General Assumptions'!D36","v":0},{"$f":"+('Input - Income'!F120+'Input - Income'!F121)*'General Assumptions'!E36","v":0},{"$f":"+('Input - Income'!G120+'Input - Income'!G121)*'General Assumptions'!F36","v":0},{"$f":"+('Input - Income'!H120+'Input - Income'!H121)*'General Assumptions'!G36","v":0},null,null,null,"Link"]
["NHS Recharges",null,{"$f":"+C18","v":0},0,0,0,0,0,null,null,null,"Link"]
["Total payroll",null,{"$f":"SUM(C27:C29)","v":0},0,0,0,0,0]
{"$rows_left_out":56}
{"sheet":"Input - Income","index":1,"n_rows":198,"n_cols":17,"rows_kept":198,"cut":false,"hidden":false,"merged":[]}
["Income Inputs"]
[]
["Key"]
["Input"]
["Optional override"]
[]
["UG student numbers",null,"2024-25","2025-26","2026-27","2027-28","2028-29","2029-30","Notes",null,null,"A","B","C1.1","C1.2","C2","D"]
[]
["Programme length (Year)",null,3]
["HEFCE price group",null,"C2"]
["Home fee per student",null,9250,{"$f":"+C11","v":9250},{"$f":"+D11","v":9250},{"$f":"+E11","v":9250},{"$f":"+E11","v":9250},{"$f":"+F11","v":9250}]
["Overseas fee per student",null,28350,{"$f":"+C12*(1+'General Assumptions'!$B6)","v":29767.5},{"$f":"+D12*(1+'General Assumptions'!$B6)","v":31255.875},{"$f":"+E12*(1+'General Assumptions'!$B6)","v":32818.668750000004},{"$f":"+F12*(1+'General Assumptions'!$B6)","v":34459.602187500008},{"$f":"+G12*(1+'General Assumptions'!$B6)","v":36182.582296875007}]
[]
["Home student numbers"]
["Intake target"]
["Year 1",null,{"$f":"+IF(C9>=1,C15,0)","v":0},{"$f":"+IF(C9>=2,C15*'General Assumptions'!C7,0)","v":0},{"$f":"+IF(C9>=3,D16*'General Assumptions'!D8,0)","v":0},{"$f":"+IF(C9>=4,C15,0)","v":0},{"$f":"+IF(C9>=5,C15,0)","v":0},0]
["Year 2",null,null,{"$f":"+IF(C9>=1,D15,0)","v":0},{"$f":"+IF(C9>=2,D15*'General Assumptions'!D7,0)","v":0},{"$f":"+IF(C9>=3,E17*'General Assumptions'!E8,0)","v":0},{"$f":"+IF(C9>=4,D15,0)","v":0},{"$f":"+IF(C9>=5,D15,0)","v":0}]
["Year 3",null,null,null,{"$f":"+IF(C9>=1,E15,0)","v":0},{"$f":"+IF(C9>=2,E15*'General Assumptions'!E7,0)","v":0},{"$f":"+IF(C9>=3,F18*'General Assumptions'!F8,0)","v":0},{"$f":"+IF(C9>=4,E15,0)","v":0}]
["Year 4",null,null,null,null,{"$f":"+IF(C9>=1,F15,0)","v":0},{"$f":"+IF(C9>=2,F15*'General Assumptions'!F7,0)","v":0},{"$f":"+IF(C9>=3,G19*'General Assumptions'!G8,0)","v":0}]
["Year 5",null,null,null,null,null,{"$f":"+IF(C9>=1,G15,0)","v":0},{"$f":"+IF(C9>=2,G15*'General Assumptions'!G7,0)","v":0}]
["Year 6",null,null,null,null,null,null,{"$f":"+IF(C9>=1,H15,0)","v":0}]
["Year 7"]
["Year 8"]
["Student population",null,{"$f":"SUM(C16:C23)","v":0},{"$f":"SUM(D16:D23)","v":0},0,0,0,0]
[]
["Overseas student numbers"]
["Intake target"]
["Year 1",null,{"$f":"+IF(C9>=1,C27,0)","v":0},{"$f":"+IF(C9>=2,C27*'General Assumptions'!C7,0)","v":0},{"$f":"+IF(C9>=3,D28*'General Assumptions'!D8,0)","v":0},{"$f":"+IF(C9>=4,C27,0)","v":0},{"$f":"+IF(C9>=5,C27,0)","v":0},0]
["Year 2",null,null,{"$f":"+IF(C9>=1,D27,0)","v":0},{"$f":"+IF(C9>=2,D27*'General Assumptions'!D7,0)","v":0},{"$f":"+IF(C9>=3,E29*'General Assumptions'!E8,0)","v":0},{"$f":"+IF(C9>=4,D27,0)","v":0},{"$f":"+IF(C9>=5,D27,0)","v":0}]
["Year 3",null,null,null,{"$f":"+IF(C9>=1,E27,0)","v":0},{"$f":"+IF(C9>=2,E27*'General Assumptions'!E7,0)","v":0},{"$f":"+IF(C9>=3,F30*'General Assumptions'!F8,0)","v":0},{"$f":"+IF(C9>=4,E27,0)","v":0}]
{"$rows_left_out":169}
{"sheet":"Input - Expenditure","index":2,"n_rows":93,"n_cols":31,"rows_kept":93,"cut":false,"hidden":false,"merged":[[2,11,3,11],[2,18,3,18],[2,26,3,26]]}
["Expenditure Inputs "]
[]
["Key",null,null,null,null,null,null,null,null,null,null,1.33,null,"Professional",null,null,null,null,1.33,null,"Lecturers",null,null,null,null,null,1.33,null,"Professors"]
["Input"]
["Optional override",null,null,null,null,null,null,null,null,null,null,"Point","Base salary 2019","Salary including on costs",null,null,null,null,"Point","Base salary 2019","Salary including on costs",null,null,null,null,null,"Point","Base salary 2019","Salary including on costs"]
[null,null,null,null,null,null,null,null,null,null,null,null,null,null,null,null,null,null,null,null,null,null,null,null,null,null,"Select Spinal Point"]
["QMUL FTE and Pay",null,"2024-25","2025-26","2026-27","2027-28","2028-29","2029-30","Notes",null,null,53,77240,{"$f":"+M7*$L$3","v":102729.20000000001},null,null,null,null,null,null,null,null,null,null,null,null,"Off £159k",{"$f":"+AB8+3000","v":159000},{"$f":"+AB7*$L$3","v":211470}]
[null,null,null,null,null,null,null,null,null,null,null,52,75116,99904.28,null,null,null,null,null,null,null,null,null,null,null,null,"Off £156k",156000,{"$f":"+AB8*$L$3","v":207480}]
["QMUL FTE",null,null,null,null,null,null,null,null,null,null,51,73057,{"$f":"+M9*$L$3","v":97165.810000000012},null,null,null,null,null,null,null,null,null,null,null,null,"Off £153k",153000,{"$f":"+AB9*$L$3","v":203490}]
["Clinical Professor",null,0,{"$f":"+C10","v":0},0,0,0,0,null,null,null,50,71057,94505.810000000012,null,null,null,null,null,null,null,null,null,null,null,null,"Off £150k",150000,{"$f":"+AB10*$L$3","v":199500}]
["Clinical Reader/Senior Lecturer",null,0,0,0,0,0,0,null,null,null,49,69114,91921.62000000001,null,null,null,null,"Select Spinal Point",null,null,null,null,null,null,null,"Off £147k",147000,{"$f":"+AB11*$L$3","v":195510}]
["Clinical Lecturer",null,0,0,0,0,0,0,null,null,null,48,67228,89413.24,null,null,null,null,"Off £99k",99000,{"$f":"+T12*$L$3","v":131670},null,null,null,null,null,"Off £144k",144000,{"$f":"+AB12*$L$3","v":191520}]
["Non-clinical professor",null,0,{"$f":"+C13","v":0},0,0,0,0,null,null,null,47,65398,86979.340000000011,null,null,null,null,"Off £96k",96000,127680,null,null,null,null,null,"Off £141k",141000,187530]
["Reader / senior lecturer",null,0,{"$f":"+C14","v":0},{"$f":"+D14","v":0},{"$f":"+E14","v":0},{"$f":"+F14","v":0},{"$f":"+G14","v":0},null,null,null,46,63622,84617.260000000009,null,null,null,null,"Off £93k",93000,123690,null,null,null,null,null,"Off £138k",138000,183540]
["Lecturer",null,0,0,0,0,0,0,null,null,null,45,61896,82321.680000000008,null,null,null,null,"Off £90k",{"$f":"+T14-3000","v":90000},119700,null,null,null,null,null,"Off £135k",135000,179550]
["Academic & professional admin",null,0,0,0,0,0,0,null,null,null,44,60221,80093.930000000008,null,null,null,null,"Off £87k",{"$f":"+T15-3000","v":87000},115710,null,null,null,null,null,"Off £132k",132000,175560]
["Teaching assistants",null,0,0,0,0,0,0,null,null,null,43,58595,77931.350000000006,null,null,null,null,"Off £84k",84000,111720,null,null,null,null,null,"Off £129k",129000,171570]
["Other (include role in notes)",null,0,0,0,0,0,0,null,null,null,42,57015,75829.95,null,null,null,null,"Off £81k",81000,107730,null,null,null,null,null,"Off £126k",126000,167580]
[null,null,null,null,null,null,null,null,null,null,null,41,55483,73792.39,null,null,null,null,"Off £78k",78000,103740,null,null,null,null,null,"Off £123k",123000,163590]
["Total QMUL FTE",null,{"$f":"SUM(C9:C19)","v":0},0,0,0,0,0,null,null,null,40,53994,71812.02,null,null,null,null,"Off £75k",75000,99750,null,null,null,null,null,"Off £120k",120000,159600]
[null,null,null,null,null,null,null,null,null,null,null,39,52549,69890.17,null,null,null,null,"Off £72k",72000,95760,null,null,null,null,null,"Off £117k",117000,155610]
["QMUL Pay","Grade",null,null,null,null,null,null,null,null,null,38,51174,68061.42,"New QMUL Pay","Exist QMUL Pay",null,null,53,77240,102729.20000000001,"New QMUL Pay","Exist QMUL Pay",null,null,null,"Off £114k",114000,151620,"New QMUL Pay","Exist QMUL Pay"]
["Clinical Professor","Select Spinal Point",{"$f":"+C10*$AD23","v":0},{"$f":"+D10*$AD23*'General Assumptions'!C11","v":0},{"$f":"+E10*$AD23*'General Assumptions'!D11","v":0},{"$f":"+F10*$AD23*'General Assumptions'!E11","v":0},{"$f":"+G10*$AD23*'General Assumptions'!F11","v":0},{"$f":"+H10*$AD23*'General Assumptions'!G11","v":0},null,null,null,37,49785,66214.05,{"$f":"IF(ISNA(VLOOKUP(B23,$L$6:$N$61,3,FALSE)),0,VLOOKUP(B23,$L$6:$N$61,3,FALSE))","v":0},{"$f":"IF(ISNA(VLOOKUP(B81,$L$6:$N$61,3,FALSE)),0,VLOOKUP(B81,$L$6:$N$61,3,FALSE))","v":0},null,null,52,75116,99904.28,{"$f":"IF(ISNA(VLOOKUP(B23,$S$10:$U$69,3,FALSE)),0,VLOOKUP(B23,$S$10:$U$69,3,FALSE))","v":0},{"$f":"IF(ISNA(VLOOKUP(B81,$S$10:$U$69,3,FALSE)),0,VLOOKUP(B81,$S$10:$U$69,3,FALSE))","v":0},null,null,null,"Off £111k",111000,147630,{"$f":"IF(ISNA(VLOOKUP(B23,$AA$5:$AC$64,3,FALSE)),0,VLOOKUP(B23,$AA$5:$AC$64,3,FALSE))","v":0},{"$f":"IF(ISNA(VLOOKUP(B81,$AA$5:$AC$64,3,FALSE)),0,VLOOKUP(B81,$AA$5:$AC$64,3,FALSE))","v":0}]
["Clinical Reader/Senior Lecturer","Select Spinal Point",{"$f":"+C11*$V24","v":0},{"$f":"+D11*$V24*'General Assumptions'!C11","v":0},{"$f":"+E11*$V24*'General Assumptions'!D11","v":0},{"$f":"+F11*$V24*'General Assumptions'!E11","v":0},{"$f":"+G11*$V24*'General Assumptions'!F11","v":0},{"$f":"+H11*$V24*'General Assumptions'!G11","v":0},null,null,null,36,48463,64455.79,0,0,null,null,51,73057,{"$f":"+T24*$L$3","v":97165.810000000012},0,0,null,null,null,"Off £108k",108000,{"$f":"+AB24*$L$3","v":143640},0,0]
["Clinical Lecturer","Select Spinal Point",{"$f":"+C12*$V25","v":0},{"$f":"+D12*$V25*'General Assumptions'!C11","v":0},{"$f":"+E12*$V25*'General Assumptions'!D11","v":0},{"$f":"+F12*$V25*'General Assumptions'!E11","v":0},{"$f":"+G12*$V25*'General Assumptions'!F11","v":0},{"$f":"+H12*$V25*'General Assumptions'!G11","v":0},null,null,null,35,47178,62746.740000000005,0,0,null,null,50,71057,{"$f":"+T25*$L$3","v":94505.810000000012},0,0,null,null,null,"Off £105k",105000,{"$f":"+AB25*$L$3","v":139650},0,0]
["Non-clinical professor","Select Spinal Point",{"$f":"+C13*$AD26","v":0},{"$f":"+D13*$AD26*'General Assumptions'!C11","v":0},{"$f":"+E13*$AD26*'General Assumptions'!D11","v":0},{"$f":"+F13*$AD26*'General Assumptions'!E11","v":0},{"$f":"+G13*$AD26*'General Assumptions'!F11","v":0},{"$f":"+H13*$AD26*'General Assumptions'!G11","v":0},null,null,null,34,45932,61089.560000000005,0,0,null,null,49,69114,91921.62000000001,0,0,null,null,null,"Off £102k",{"$f":"+AB27+3000","v":102000},{"$f":"+AB26*$L$3","v":135660},0,0]
["Reader / senior lecturer","Select Spinal Point",{"$f":"+C14*$V27","v":0},{"$f":"+D14*$V27*'General Assumptions'!C11","v":0},{"$f":"+E14*$V27*'General Assumptions'!D11","v":0},{"$f":"+F14*$V27*'General Assumptions'!E11","v":0},{"$f":"+G14*$V27*'General Assumptions'!F11","v":0},{"$f":"+H14*$V27*'General Assumptions'!G11","v":0},null,null,null,33,44722,59480.26,0,0,null,null,48,67228,89413.24,0,0,null,null,null,"Off £99k",99000,{"$f":"+AB27*$L$3","v":131670},0,0]
["Lecturer","Select Spinal Point",{"$f":"+C15*$V28","v":0},{"$f":"+D15*$V28*'General Assumptions'!C11","v":0},{"$f":"+E15*$V28*'General Assumptions'!D11","v":0},{"$f":"+F15*$V28*'General Assumptions'!E11","v":0},{"$f":"+G15*$V28*'General Assumptions'!F11","v":0},{"$f":"+H15*$V28*'General Assumptions'!G11","v":0},null,null,null,32,43548,57918.840000000004,0,0,null,null,47,65398,86979.340000000011,0,0,null,null,null,"Off £96k",96000,127680,0,0]
["Academic & professional admin","Select Spinal Point",{"$f":"+C16*$O29","v":0},{"$f":"+D16*$O29*'General Assumptions'!C11","v":0},{"$f":"+E16*$O29*'General Assumptions'!D11","v":0},{"$f":"+F16*$O29*'General Assumptions'!E11","v":0},{"$f":"+G16*$O29*'General Assumptions'!F11","v":0},{"$f":"+H16*$O29*'General Assumptions'!G11","v":0},null,null,null,31,42405,56398.65,0,0,null,null,46,63622,84617.260000000009,0,0,null,null,null,"Off £93k",93000,123690,0,0]
["Teaching assistants","Select Spinal Point",{"$f":"+C17*$O30","v":0},{"$f":"+D17*$O30*'General Assumptions'!C11","v":0},{"$f":"+E17*$O30*'General Assumptions'!D11","v":0},{"$f":"+F17*$O30*'General Assumptions'!E11","v":0},{"$f":"+G17*$O30*'General Assumptions'!F11","v":0},{"$f":"+H17*$O30*'General Assumptions'!G11","v":0},null,null,null,30,41300,54929,0,0,null,null,45,61896,82321.680000000008,0,0,null,null,null,"Off £90k",{"$f":"+AB29-3000","v":90000},119700,0,0]
{"$rows_left_out":64}
{"sheet":"General Assumptions","index":3,"n_rows":43,"n_cols":8,"rows_kept":43,"cut":false,"hidden":false,"merged":[]}
["General Assumptions"]
[]
["Inflation","2024-25","2025-26","2026-27","2027-28","2028-29","2029-30","Notes"]
[]
["Tuition fees - Home",0.02,0.02,0.02,0.02,0.02,0.02]
["Tuition fees - Overseas",0.05,0.05,0.05,0.05,0.05,0.03]
["Progression Y1 to Y2",{"$f":"1-12.3%","v":0.877},{"$f":"B7","v":0.877},{"$f":"C7","v":0.877},0.877,0.877,0.877]
["Progression Y2 to Y3",{"$f":"1-4.9%","v":0.95099999999999996},{"$f":"B8","v":0.95099999999999996},0.95099999999999996,0.95099999999999996,0.95099999999999996,0.95099999999999996]
["Other income",0.02,0.02,0.02,0.02,0.02,0.02]
["Pay *",3.5000000000000003E-2,3.5000000000000003E-2,2.5000000000000001E-2,2.5000000000000001E-2,0.02,0.02]
["Compound pay inflation",1,{"$f":"+B11*1+C10","v":1.0349999999999999},{"$f":"+C11*1+D10","v":1.0599999999999998},1.0849999999999997,1.1049999999999998,1.1249999999999998]
["Non pay",0.02,0.02,0.02,0.02,0.02,0.02]
["Overseas students recruited by agents - UG",0.5,0.5,0.5,0.5,0.5,0.5]
["Overseas students recruited by agents - PGT",0.5,0.5,0.5,0.5,0.5,0.5]
["Agents Commission",0.15,{"$f":"B15","v":0.15},{"$f":"C15","v":0.15},0.15,0.15,0.15]
[]
["Funding body rate assumptions","2024-25","2025-26","2026-27","2027-28","2028-29","2029-30","Notes"]
[]
["OFS Price group A - UG rate",10000,{"$f":"+B19","v":10000},10000,10000,10000,10000]
["OFS Price group B - UG rate",1500,1500,1500,1500,1500,1500]
["OFS Price group C1.1 - UG rate",250,250,250,250,250,250]
["OFS Price group C1.2 - UG rate",120,120,120,120,120,120]
["OFS Price group C2 - UG rate",0,0,0,0,0,0]
["OFS Price group D - UG rate",0,0,0,0,0,0]
["OFS Price group A - PGT rate",10000,{"$f":"+B25","v":10000},10000,10000,10000,10000]
["OFS Price group B - PGT rate",1500,{"$f":"+B26","v":1500},1500,1500,1500,1500]
["OFS Price group C1.1 - PGT rate",250,250,250,250,250,250]
["OFS Price group C1.2 - PGT rate",120,120,120,120,120,120]
["OFS Price group C2 - PGT rate",0,0,0,0,0,0]
["OFS Price group D - PGT rate",0,0,0,0,0,0]
{"$rows_left_out":13}